Target
Gamma-aminobutyric acid receptor subunit alpha-1
Ligand
BDBM85195
Substrate
Ki
>10000±n/a nM
Comments
PDSP_1150
Citation
 Phebus, LAJohnson, KWZgombick, JMGilbert, PJVan Belle, KMancuso, VNelson, DLCalligaro, DOKiefer, ADBranchek, TAFlaugh, ME Characterization of LY344864 as a pharmacological tool to study 5-HT1F receptors: binding affinities, brain penetration and activity in the neurogenic dural inflammation model of migraine. Life Sci 61:2117-26 (1997)  
Target
Name:
Gamma-aminobutyric acid receptor subunit alpha-1
Synonyms:
Benzodiazepine central GABA A Benzodiazepine GABA A Benzodiazepine Type II GABA A Benzodiazepine Type IIM GABA A Benzodiazepine omega2 GABA A alpha1 GABA receptor alpha-1 subunit GABA-PICROTOXIN Gabra-1 TBPS
Type:
Enzyme
Mol. Mass.:
51770.21
Organism:
Rattus norvegicus (Rat)
Description:
P62813
Residue:
455
  
Inhibitor
Name:
BDBM85195
Synonyms:
CAS_5311097 NSC_5311097
Type:
Small organic molecule
Emp. Form.:
C21H22FN3O
Mol. Mass.:
351.4173
SMILES:
CN(C)C1CCc2[nH]c3ccc(NC(=O)c4ccc(F)cc4)cc3c2C1
: