Target
Gamma-aminobutyric acid receptor subunit alpha-1
Ligand
BDBM23183
Substrate
Ki
6.76±n/a nM
Comments
PDSP_1260
Citation
 Ebert, BThompson, SASaounatsou, KMcKernan, RKrogsgaard-Larsen, PWafford, KA Differences in agonist/antagonist binding affinity and receptor transduction using recombinant human gamma-aminobutyric acid type A receptors. Mol Pharmacol 52:1150-6 (1997) Target
Name:
Gamma-aminobutyric acid receptor subunit alpha-1
Synonyms:
Benzodiazepine central GABA A Benzodiazepine liver GABA(A) receptor subunit alpha-1 GABA-A receptor GBRA1_HUMAN TBPS | agonist GABA site
Type:
Protein
Mol. Mass.:
51817.35
Organism:
Homo sapiens (Human)
Description:
P14867
Residue:
456
  
Inhibitor
Name:
BDBM23183
Synonyms:
5-(aminomethyl)-1,2-oxazol-3-ol CHEMBL273481 Pantherine
Type:
GABA Agonist
Emp. Form.:
C4H6N2O2
Mol. Mass.:
114.1026
SMILES:
NCc1cc(=O)[nH]o1
: