Target
Galanin receptor type 3
Ligand
BDBM50273369
Substrate
Ki
85±n/a nM
Comments
PDSP_852
Citation
 Wang, SHe, CHashemi, TBayne, M Cloning and expressional characterization of a novel galanin receptor. Identification of different pharmacophores within galanin for the three galanin receptor subtypes. J Biol Chem 272:31949-52 (1997)  
Target
Name:
Galanin receptor type 3
Synonyms:
GALR3_RAT Galanin receptor type 3 Galr3
Type:
Enzyme Catalytic Domain
Mol. Mass.:
40439.51
Organism:
RAT
Description:
Galanin R3 GALR3 RAT::O88626
Residue:
370
  
Inhibitor
Name:
BDBM50273369
Synonyms:
CHEMBL526003 Galanin (1-13)-SP-(5-11) | galantide
Type:
Small organic molecule
Emp. Form.:
C104H151N25O26S
Mol. Mass.:
2199.529
SMILES:
CSCC[C@H](NC(=O)[C@H](CC(C)C)NC(=O)CNC(=O)[C@H](Cc1ccccc1)NC(=O)[C@H](Cc1ccccc1)NC(=O)[C@H](CCC(N)=O)NC(=O)[C@H](CCC(N)=O)NC(=O)[C@@H]1CCCN1C(=O)CNC(=O)[C@H](CC(C)C)NC(=O)[C@H](CC(C)C)NC(=O)[C@H](Cc1ccc(O)cc1)NC(=O)CNC(=O)[C@H](C)NC(=O)[C@H](CO)NC(=O)[C@H](CC(N)=O)NC(=O)[C@H](CC(C)C)NC(=O)[C@@H](NC(=O)[C@H](Cc1c[nH]c2ccccc12)NC(=O)CN)[C@@H](C)O)C(N)=O
: