Target
Neuronal acetylcholine receptor subunit alpha-4
Ligand
BDBM50004108
Substrate
Ki
1±n/a nM
Comments
PDSP_1311
Citation
 Bannon, AWDecker, MWHolladay, MWCurzon, PDonnelly-Roberts, DPuttfarcken, PSBitner, RSDiaz, ADickenson, AHPorsolt, RDWilliams, MArneric, SP Broad-spectrum, non-opioid analgesic activity by selective modulation of neuronal nicotinic acetylcholine receptors. Science 279:77-81 (1998)  
Target
Name:
Neuronal acetylcholine receptor subunit alpha-4
Synonyms:
ACHA4_RAT Cholinergic, Nicotinic Alpha4Beta2 Chrna4 Neuronal acetylcholine receptor (alpha4beta2 nAChR) Neuronal acetylcholine receptor subunit alpha 4 beta 2 | Neuronal acetylcholine receptor subunit alpha-4
Type:
Enzyme
Mol. Mass.:
70196.44
Organism:
Rattus norvegicus (Rat)
Description:
P09483
Residue:
630
  
Inhibitor
Name:
BDBM50004108
Synonyms:
(+-)-nicotine (RS)-nicotine CHEMBL440464 Nicotine-(+) US11667638, Example Nicotine US9284322, Nicotine nicotine
Type:
Small organic molecule
Emp. Form.:
C10H14N2
Mol. Mass.:
162.2316
SMILES:
CN1CCCC1c1cccnc1
: