Target
D(1A) dopamine receptor
Ligand
BDBM50026045
Substrate
Ki
>10000±n/a nM
Comments
PDSP_1593
Citation
 Arnt, JSkarsfeldt, T Do novel antipsychotics have similar pharmacological characteristics? A review of the evidence. Neuropsychopharmacology 18:63-101 (1998)  
Target
Name:
D(1A) dopamine receptor
Synonyms:
DOPAMINE D1 Dopamine D1 high Dopamine receptor Dopamine1-like Drd1a
Type:
Enzyme Catalytic Domain
Mol. Mass.:
49429.75
Organism:
RAT
Description:
P18901
Residue:
446
  
Inhibitor
Name:
BDBM50026045
Synonyms:
(R,S)-3-Bromo-N-(1-ethyl-pyrrolidin-2-ylmethyl)-2,6-dimethoxy-benzamide 3-Bromo-N-((R)-1-ethyl-pyrrolidin-2-ylmethyl)-2,6-dimethoxy-benzamide 3-Bromo-N-(1-ethyl-pyrrolidin-2-ylmethyl)-2,6-dimethoxy-benzamide 3-Bromo-N-(1-ethyl-pyrrolidin-2-ylmethyl)-2,6-dimethoxy-benzamide(remoxipride) REMOXIPRIDE
Type:
Small organic molecule
Emp. Form.:
C16H23BrN2O3
Mol. Mass.:
371.269
SMILES:
CCN1CCC[C@H]1CNC(=O)c1c(OC)ccc(Br)c1OC
: