Target
Cathepsin D
Ligand
BDBM50055892
Substrate
Meas. Tech.
In-Vitro Fluorescence Assay
pH
5.5±n/a
Temperature
298.15±n/a K
IC50
24.0±n/a nM
Comments
extracted
Citation
 Tsaklakidis, CKlein, MCzodrowski, P Acylguanidines for treating osteoarthritis US Patent  US9884814 Publication Date 2/6/2018 
Target
Name:
Cathepsin D
Synonyms:
CATD_HUMAN CTSD Cathepsin D heavy chain Cathepsin D precursor
Type:
Enzyme
Mol. Mass.:
44551.72
Organism:
Homo sapiens (Human)
Description:
Human proCathepsin D (SwissProt accession number P07339) was expressed in Sf9 cells, purified, and autoactivated.
Residue:
412
  
Inhibitor
Name:
BDBM50055892
Synonyms:
CHEMBL3321931 | US9884814, Compound 44
Type:
Small organic molecule
Emp. Form.:
C25H33FN4O5
Mol. Mass.:
488.5517
SMILES:
COc1cc(CNC(=O)[C@@H](CC(C)C)NC(=N)NC(=O)Cc2ccc(OC)c(OC)c2)ccc1F
: