Target
Cathepsin D
Ligand
BDBM275587
Substrate
Meas. Tech.
In-Vitro Fluorescence Assay
pH
5.5±n/a
Temperature
298.15±n/a K
IC50
49.0±n/a nM
Comments
extracted
Citation
 Tsaklakidis, CKlein, MCzodrowski, P Acylguanidines for treating osteoarthritis US Patent  US9884814 Publication Date 2/6/2018 
Target
Name:
Cathepsin D
Synonyms:
CATD_HUMAN CTSD Cathepsin D heavy chain Cathepsin D precursor
Type:
Enzyme
Mol. Mass.:
44551.72
Organism:
Homo sapiens (Human)
Description:
Human proCathepsin D (SwissProt accession number P07339) was expressed in Sf9 cells, purified, and autoactivated.
Residue:
412
  
Inhibitor
Name:
BDBM275587
Synonyms:
US9884814, Compound 162
Type:
Small organic molecule
Emp. Form.:
C27H37N5O6S
Mol. Mass.:
559.678
SMILES:
COc1ccc(CC(=O)NC(=N)N[C@H](CC2CCCCC2)C(=O)NCc2ccc(cc2)S(N)(=O)=O)cc1OC
: