Target
Cathepsin D
Ligand
BDBM275673
Substrate
Meas. Tech.
In-Vitro Fluorescence Assay
pH
5.5±n/a
Temperature
298.15±n/a K
IC50
61.0±n/a nM
Comments
extracted
Citation
 Tsaklakidis, CKlein, MCzodrowski, P Acylguanidines for treating osteoarthritis US Patent  US9884814 Publication Date 2/6/2018 
Target
Name:
Cathepsin D
Synonyms:
CATD_HUMAN CTSD Cathepsin D heavy chain Cathepsin D precursor
Type:
Enzyme
Mol. Mass.:
44551.72
Organism:
Homo sapiens (Human)
Description:
Human proCathepsin D (SwissProt accession number P07339) was expressed in Sf9 cells, purified, and autoactivated.
Residue:
412
  
Inhibitor
Name:
BDBM275673
Synonyms:
US9884814, Compound 286
Type:
Small organic molecule
Emp. Form.:
C29H35FN6O4
Mol. Mass.:
550.6244
SMILES:
COc1cc(CNC(=O)[C@@H](CC2CCCCC2)NC(=N)NC(=O)Cc2ccc(cc2)-c2noc(C)n2)ccc1F
: