Target
Gamma-aminobutyric acid receptor subunit alpha-1
Ligand
BDBM50000766
Substrate
Ki
30.8±n/a nM
Comments
PDSP_656
Citation
 Yamagishi, HKawaguchi, M Characterization of central- and peripheral-type benzodiazepine receptors in rat salivary glands. Biochem Pharmacol 55:209-14 (1998)  
Target
Name:
Gamma-aminobutyric acid receptor subunit alpha-1
Synonyms:
Benzodiazepine central GABA A Benzodiazepine GABA A Benzodiazepine Type II GABA A Benzodiazepine Type IIM GABA A Benzodiazepine omega2 GABA A alpha1 GABA receptor alpha-1 subunit GABA-PICROTOXIN Gabra-1 TBPS
Type:
Enzyme
Mol. Mass.:
51770.21
Organism:
Rattus norvegicus (Rat)
Description:
P62813
Residue:
455
  
Inhibitor
Name:
BDBM50000766
Synonyms:
CHEMBL12 US9271961, Diazepam
Type:
Small organic molecule
Emp. Form.:
C16H13ClN2O
Mol. Mass.:
284.74
SMILES:
CN1c2ccc(Cl)cc2C(=NCC1=O)c1ccccc1
: