Target
Gamma-aminobutyric acid receptor subunit alpha-1
Ligand
BDBM22032
Substrate
Ki
1.88±n/a nM
Comments
PDSP_1506
Citation
 Yamagishi, HKawaguchi, M Characterization of central- and peripheral-type benzodiazepine receptors in rat salivary glands. Biochem Pharmacol 55:209-14 (1998)  
Target
Name:
Gamma-aminobutyric acid receptor subunit alpha-1
Synonyms:
Benzodiazepine central GABA A Benzodiazepine GABA A Benzodiazepine Type II GABA A Benzodiazepine Type IIM GABA A Benzodiazepine omega2 GABA A alpha1 GABA receptor alpha-1 subunit GABA-PICROTOXIN Gabra-1 TBPS
Type:
Enzyme
Mol. Mass.:
51770.21
Organism:
Rattus norvegicus (Rat)
Description:
P62813
Residue:
455
  
Inhibitor
Name:
BDBM22032
Synonyms:
1-(2-chlorophenyl)-N-methyl-N-(1-methylpropyl)isoquinoline-3-carboxamide N-(butan-2-yl)-1-(2-chlorophenyl)-N-methylisoquinoline-3-carboxamide PK-11195 RP 52028 | [3H]PK 11195
Type:
radiolabeled ligand
Emp. Form.:
C21H21ClN2O
Mol. Mass.:
352.857
SMILES:
CCC(C)N(C)C(=O)c1cc2ccccc2c(n1)-c1ccccc1Cl
: