Target
Cannabinoid receptor 2
Ligand
BDBM21280
Substrate
Ki
0.3±n/a nM
Comments
PDSP_1751
Citation
 Rinaldi-Carmona, MBarth, FMillan, JDerocq, JMCasellas, PCongy, COustric, DSarran, MBouaboula, MCalandra, BPortier, MShire, DBrelière, JCLe Fur, GL SR 144528, the first potent and selective antagonist of the CB2 cannabinoid receptor. J Pharmacol Exp Ther 284:644-50 (1998) Target
Name:
Cannabinoid receptor 2
Synonyms:
CANNABINOID CB2 CB2 Cannabinoid CB2 receptor Cnr2 | rCB2
Type:
Enzyme
Mol. Mass.:
39366.68
Organism:
Rattus norvegicus (Rat)
Description:
Q9QZN9
Residue:
360
  
Inhibitor
Name:
BDBM21280
Synonyms:
5-(4-chloro-3-methylphenyl)-1-[(4-methylphenyl)methyl]-N-[(1S)-1,3,3-trimethylbicyclo[2.2.1]heptan-2-yl]-1H-pyrazole-3-carboxamide SR 144528 SR144528
Type:
Small organic molecule
Emp. Form.:
C29H34ClN3O
Mol. Mass.:
476.053
SMILES:
Cc1ccc(Cn2nc(cc2-c2ccc(Cl)c(C)c2)C(=O)NC2[C@@]3(C)CCC(C3)C2(C)C)cc1
: