Target
Neuronal acetylcholine receptor subunit alpha-4
Ligand
BDBM81458
Substrate
Ki
860±n/a nM
Comments
PDSP_761
Citation
 Stauderman, KAMahaffy, LSAkong, MVeliçelebi, GChavez-Noriega, LECrona, JHJohnson, ECElliott, KJGillespie, AReid, RTAdams, PHarpold, MMCorey-Naeve, J Characterization of human recombinant neuronal nicotinic acetylcholine receptor subunit combinations alpha2beta4, alpha3beta4 and alpha4beta4 stably expressed in HEK293 cells. J Pharmacol Exp Ther 284:777-89 (1998) Target
Name:
Neuronal acetylcholine receptor subunit alpha-4
Synonyms:
ACHA4_HUMAN CHRNA4 protein Neuronal acetylcholine receptor protein alpha-4 subunit Nicotinic acetylcholine receptor alpha4/beta2/alpha5
Type:
Mol. Mass.:
69963.49
Organism:
Homo sapiens (Human)
Description:
NACHRA4
Residue:
627
  
Inhibitor
Name:
BDBM81458
Synonyms:
CAS_57-94-3 d-Tubocurarine
Type:
Small organic molecule
Emp. Form.:
C37H41N2O6
Mol. Mass.:
609.7307
SMILES:
COc1cc2CC[N+](C)(C)C3Cc4ccc(O)c(Oc5cc6C(Cc7ccc(Oc(c1O)c23)cc7)N(C)CCc6cc5OC)c4
: