Target
Metabotropic glutamate receptor 2
Ligand
BDBM50004051
Substrate
Ki
>10000±n/a nM
Comments
PDSP_2029
Citation
 Schaffhauser, HRichards, JGCartmell, JChaboz, SKemp, JAKlingelschmidt, AMesser, JStadler, HWoltering, TMutel, V In vitro binding characteristics of a new selective group II metabotropic glutamate receptor radioligand, [3H]LY354740, in rat brain. Mol Pharmacol 53:228-33 (1998) Target
Name:
Metabotropic glutamate receptor 2
Synonyms:
GPRC1B GRM2_HUMAN Metabotropic glutamate receptor mGlu2 | metabotropic glutamate 2
Type:
Enzyme
Mol. Mass.:
95584.88
Organism:
Homo sapiens (Human)
Description:
Q14416
Residue:
872
  
Inhibitor
Name:
BDBM50004051
Synonyms:
2-Amino-4-phosphono-butyric acid 4-Amino Phosphonobutyrate GlcN-6-P synthase inhibitor, 1 (racemic mixture) | L-AP4
Type:
Small organic molecule
Emp. Form.:
C4H10NO5P
Mol. Mass.:
183.0997
SMILES:
NC(CCP(O)(O)=O)C(O)=O
: