Target
Fibroblast growth factor receptor 4
Ligand
BDBM142256
Substrate
Meas. Tech.
Cell-Free Kinase Inhibitory Activity
Temperature
298.15±n/a K
IC50
683±n/a nM
Comments
extracted
Citation
 Ozaki, SYoshida, K Salt of monocyclic pyridine derivative and crystal thereof US Patent  US9951047 Publication Date 4/24/2018 
Target
Name:
Fibroblast growth factor receptor 4
Synonyms:
CD_antigen: CD334 FGFR4 FGFR4 Fibroblast growth factor receptor JK2 TKF
Type:
Protein
Mol. Mass.:
87957.45
Organism:
Homo sapiens (Human)
Description:
P22455
Residue:
802
  
Inhibitor
Name:
BDBM142256
Synonyms:
US8933099, 22 | US9951047, Compound (I)
Type:
Small organic molecule
Emp. Form.:
C32H37N5O6
Mol. Mass.:
587.6661
SMILES:
CNC(=O)n1ccc2cc(Oc3ccnc(NC(=O)c4ccc(cc4)C4CCN(CCO)CC4)c3)c(OCCOC)cc12
: