Target
D(2) dopamine receptor
Ligand
BDBM50130257
Substrate
Ki
3.3±n/a nM
Comments
PDSP_515
Citation
 Seeman, PTallerico, T Antipsychotic drugs which elicit little or no parkinsonism bind more loosely than dopamine to brain D2 receptors, yet occupy high levels of these receptors. Mol Psychiatry 3:123-34 (1998)  
Target
Name:
D(2) dopamine receptor
Synonyms:
D(2) dopamine receptor DOPAMINE D2 Long DRD2 Dopamine D2 receptor Dopamine D2 receptor (D2R) Dopamine2-like | d2
Type:
Cell-surface receptors
Mol. Mass.:
50647.10
Organism:
Homo sapiens (Human)
Description:
P14416
Residue:
443
  
Inhibitor
Name:
BDBM50130257
Synonyms:
(3E)-3-(2-chloro-9H-thioxanthen-9-ylidene)-N,N-dimethylpropan-1-amine CHEMBL90125 Chlorprothixene (cis)
Type:
Small organic molecule
Emp. Form.:
C18H18ClNS
Mol. Mass.:
315.86
SMILES:
CN(C)CC\C=C1/c2ccccc2Sc2ccc(Cl)cc12
: