Target
Protein kinase C alpha type
Ligand
BDBM3245
Substrate
Histone type HL
Meas. Tech.
PKC assay
pH
7.5±n/a
Temperature
303.15±n/a K
IC50
3100±n/a nM
Citation
 Crane, HMMenaldino, DSJagdmann, GEDarges, JWBuben, JA Increasing the cellular PKC inhibitory activity of balanol: a study of ester analogs. Bioorg Med Chem Lett 5:2133-8 (1995)    Article 
Target
Name:
Protein kinase C alpha type
Synonyms:
KPCA_HUMAN PKC alpha and beta-2 PKC-alpha PRKACA Protein Kinase C- alpha Protein kinase C alpha (PKCa) Protein kinase C alpha type (PRKCA) RAF proto-oncogene serine/threonine-protein kinase
Type:
Enzyme
Mol. Mass.:
76755.65
Organism:
Homo sapiens (Human)
Description:
The recombinant human PKC enzymes were produced using a baculovirus expression system in SF9 cells
Residue:
672
  
Inhibitor
Name:
BDBM3245
Synonyms:
(3R,4R)-4-[(4-hydroxybenzene)amido]pyrrolidin-3-yl 4-{[2-(butoxycarbonyl)-6-hydroxyphenyl]carbonyl}-3,5-dihydroxybenzoate | Balanol Benzophenone Ester Analog 17
Type:
Small organic molecule
Emp. Form.:
C30H30N2O10
Mol. Mass.:
578.5666
SMILES:
CCCCOC(=O)c1cccc(O)c1C(=O)c1c(O)cc(cc1O)C(=O)O[C@@H]1CNC[C@H]1NC(=O)c1ccc(O)cc1
:
Substrate
Name:
Histone type HL
Synonyms:
Type:
Peptide
Mol. Mass.:
358.43
Organism:
Description:
unfractionated histone (Worthington) 30 uM [gamma-32P]ATP as co-substrate.
Residue:
3
NA