Target
5-hydroxytryptamine receptor 4
Ligand
BDBM50000492
Substrate
Ki
7750±n/a nM
Comments
PDSP_1988
Citation
 Blondel, OGastineau, MDahmoune, YLanglois, MFischmeister, R Cloning, expression, and pharmacology of four human 5-hydroxytryptamine 4 receptor isoforms produced by alternative splicing in the carboxyl terminus. J Neurochem 70:2252-61 (1998)  
Target
Name:
5-hydroxytryptamine receptor 4
Synonyms:
5-HT-4 5-HT4S 5-HT4b 5-HT4d 5-hydroxytryptamine receptor 4 5HT4R_HUMAN Serotonin (5-HT) receptor Serotonin 4 (5-HT4) receptor | Serotonin Receptor 4
Type:
Enzyme
Mol. Mass.:
43767.54
Organism:
Homo sapiens (Human)
Description:
Q13639
Residue:
388
  
Inhibitor
Name:
BDBM50000492
Synonyms:
(zacopride)4-Amino-N-(1-aza-bicyclo[2.2.2]oct-3-yl)-5-chloro-2-methoxy-benzamide 4-Amino-N-(1-aza-bicyclo[2.2.2]oct-3-yl)-5-chloro-2-methoxy-benzamide (Zacopride) CHEMBL18041 ZACOPRIDE ZACOPRIDE,RS | ZACOPRIDE,S
Type:
Small organic molecule
Emp. Form.:
C15H20ClN3O2
Mol. Mass.:
309.791
SMILES:
COc1cc(N)c(Cl)cc1C(=O)NC1CN2CCC1CC2
: