Target
Alpha-2A adrenergic receptor
Ligand
BDBM85233
Substrate
Ki
14.45±n/a nM
Comments
PDSP_5982
Citation
 Jasper, JRLesnick, JDChang, LKYamanishi, SSChang, TKHsu, SADaunt, DABonhaus, DWEglen, RM Ligand efficacy and potency at recombinant alpha2 adrenergic receptors: agonist-mediated [35S]GTPgammaS binding. Biochem Pharmacol 55:1035-43 (1998)  
Target
Name:
Alpha-2A adrenergic receptor
Synonyms:
ADA2A_HUMAN ADRA2R Adrenergic alpha2A Alpha-2 adrenergic receptor subtype C10 Alpha-2A adrenoreceptor alpha-2A adrenergic receptor [Homo sapiens]
Type:
Enzyme
Mol. Mass.:
48979.91
Organism:
Homo sapiens (Human)
Description:
P08913
Residue:
450
  
Inhibitor
Name:
BDBM85233
Synonyms:
CAS_81447-78-1 | Levlofexidine
Type:
Small organic molecule
Emp. Form.:
C11H12Cl2N2O
Mol. Mass.:
259.132
SMILES:
C[C@@H](Oc1c(Cl)cccc1Cl)C1=NCCN1
: