Target
Alpha-2A adrenergic receptor
Ligand
BDBM50027056
Substrate
Ki
31.62±n/a nM
Comments
PDSP_1895
Citation
 Jasper, JRLesnick, JDChang, LKYamanishi, SSChang, TKHsu, SADaunt, DABonhaus, DWEglen, RM Ligand efficacy and potency at recombinant alpha2 adrenergic receptors: agonist-mediated [35S]GTPgammaS binding. Biochem Pharmacol 55:1035-43 (1998)  
Target
Name:
Alpha-2A adrenergic receptor
Synonyms:
ADA2A_HUMAN ADRA2R Adrenergic alpha2A Alpha-2 adrenergic receptor subtype C10 Alpha-2A adrenoreceptor alpha-2A adrenergic receptor [Homo sapiens]
Type:
Enzyme
Mol. Mass.:
48979.91
Organism:
Homo sapiens (Human)
Description:
P08913
Residue:
450
  
Inhibitor
Name:
BDBM50027056
Synonyms:
(4,5-Dihydro-1H-imidazol-2-yl)-(5,6,7,8-tetrahydro-naphthalen-1-yl)-amine Imidazolidin-2-ylidene-(5,6,7,8-tetrahydro-naphthalen-1-yl)-amine | Tramazoline
Type:
Small organic molecule
Emp. Form.:
C13H17N3
Mol. Mass.:
215.2942
SMILES:
[#6]-1-[#6]-[#7]\[#6](-[#7]-1)=[#7]\c1cccc2-[#6]-[#6]-[#6]-[#6]-c12
: