Target
Prostaglandin G/H synthase 1
Ligand
BDBM85242
Substrate
Ki
>10000±n/a nM
Comments
PDSP_4488
Citation
 Cryer, BFeldman, M Cyclooxygenase-1 and cyclooxygenase-2 selectivity of widely used nonsteroidal anti-inflammatory drugs. Am J Med 104:413-21 (1998)  
Target
Name:
Prostaglandin G/H synthase 1
Synonyms:
COX-1 Cyclooxygenase Cyclooxygenase-1 (COX-1) PTGS1 | Prostaglandin G/H synthase (cyclooxygenase)
Type:
Enzyme
Mol. Mass.:
68692.62
Organism:
Homo sapiens (Human)
Description:
P23219
Residue:
599
  
Inhibitor
Name:
BDBM85242
Synonyms:
Bismuth subsalicylate NSC_26947
Type:
Small organic molecule
Emp. Form.:
BiH3
Mol. Mass.:
212.0042
SMILES:
[Bi;v3]
: