Target
Somatostatin receptor type 2
Ligand
BDBM82471
Substrate
Ki
3981.07±n/a nM
Comments
PDSP_602
Citation
 Siehler, SSeuwen, KHoyer, D [125I]Tyr10-cortistatin14 labels all five somatostatin receptors. Naunyn Schmiedebergs Arch Pharmacol 357:483-9 (1998)  
Target
Name:
Somatostatin receptor type 2
Synonyms:
SOMATOSTATIN SST2 SS-2-R SS2R SSTR2 | Somatostatin receptor type 2 (SSTR2)
Type:
Enzyme
Mol. Mass.:
41344.94
Organism:
Homo sapiens (Human)
Description:
P30874
Residue:
369
  
Inhibitor
Name:
BDBM82471
Synonyms:
c[Aha-Phe-D-Trp-Lys-Thr(Bzl)] | cycloantagonist SA
Type:
Small organic molecule
Emp. Form.:
C42H55N7O5
Mol. Mass.:
737.93
SMILES:
C[C@@H](Oc1ccccc1)[C@@H]1NC(=O)[C@H](CCCCN)NC(=O)[C@@H](Cc2c[nH]c3ccccc23)NC(=O)[C@H](Cc2ccccc2)NCCCCCCNC1=O
: