Target
UDP-N-acetylmuramoyl-tripeptide--D-alanyl-D-alanine ligase
Ligand
BDBM85276
Substrate
Meas. Tech.
Enzymatic Assay
pH
8±0
Temperature
310.15±0 K
IC50
2.40e+5±n/a nM
Citation
 Sova, MKovac, ATurk, SHrast, MBlanot, DGobec, S Phosphorylated hydroxyethylamines as novel inhibitors of the bacterial cell wall biosynthesis enzymes MurC to MurF. Bioorg Chem 37:217-22 (2009)  
Target
Name:
UDP-N-acetylmuramoyl-tripeptide--D-alanyl-D-alanine ligase
Synonyms:
MURF_ECOLI mra | murF
Type:
Protein
Mol. Mass.:
47439.03
Organism:
Escherichia coli
Description:
P11880
Residue:
452
  
Inhibitor
Name:
BDBM85276
Synonyms:
HEA derivative, 7c | MurC/D/E/F inhibitor (compound 68)
Type:
Small organic molecule
Emp. Form.:
C14H20F3N2O7PS
Mol. Mass.:
448.352
SMILES:
OP(O)(=O)OC(CNS(=O)(=O)c1ccc(cc1)C(F)(F)F)CN1CCOCC1
: