Target
Collagenase 3
Ligand
BDBM85281
Substrate
Meas. Tech.
Fluorimetric Assay
pH
7±0
Temperature
298.15±0 K
IC50
4.5e+4±n/a nM
Citation
 Panico, AMVicini, PGeronikaki, AIncerti, MCardile, VCrascì, LMessina, RRonsisvalle, S Heteroarylimino-4-thiazolidinones as inhibitors of cartilage degradation. Bioorg Chem 39:48-52 (2011)  
Target
Name:
Collagenase 3
Synonyms:
MMP-13 MMP13_HUMAN Matrix metalloproteinase-13 (MMP-13) | Matrix metalloproteinase-13 (MMP13)
Type:
Enzyme
Mol. Mass.:
53808.06
Organism:
Homo sapiens (Human)
Description:
P45452
Residue:
471
  
Inhibitor
Name:
BDBM85281
Synonyms:
2-(benzo[d]-thiazol-2-ylimino)-5-benzylidenethiazolidin-4-one, 2a
Type:
Small organic molecule
Emp. Form.:
C17H11N3OS2
Mol. Mass.:
337.419
SMILES:
O=C1N\C(S\C1=C\c1ccccc1)=N/c1nc2ccccc2s1
: