Target
Glutamine synthetase
Ligand
BDBM85292
Substrate
Meas. Tech.
Enzyme Assay
pH
7±0
Ki
310±20 nM
Citation
 Johnson, RCBoettcher, BRCherpeck, REDolson, MG Design and Synthesis of Potent Inhibitors of Glutamine Synthetase Bioorg Chem 18:154-9 (1990)   
Target
Name:
Glutamine synthetase
Synonyms:
GLNA_HUMAN GLUL | Glutamate decarboxylase
Type:
Protein
Mol. Mass.:
42066.51
Organism:
Homo sapiens (Human)
Description:
P15104
Residue:
373
  
Inhibitor
Name:
BDBM85292
Synonyms:
Phosphinothricin analog, 5 (D,L Isomer)
Type:
Small organic molecule
Emp. Form.:
C8H16NO4P
Mol. Mass.:
221.1907
SMILES:
CP(O)([O-])C1=C[C@]([NH3+])(CCC1)C(O)=O
: