Target
Glutamine--fructose-6-phosphate aminotransferase [isomerizing]
Ligand
BDBM85320
Substrate
Meas. Tech.
Enzyme Assay
pH
6.85±0
Ki
1500000±0.0 nM
IC50
2800000±0.0 nM
Citation
 Milewski, SHoffmann, MAndruszkiewicz, RBorowski, E Investigation of Mechanism of Nitrogen Transfer in Glucosamine 6-Phosphate Synthase with the Use of Transition State Analogs Bioorg Chem 25:283-296 (1997)   
Target
Name:
Glutamine--fructose-6-phosphate aminotransferase [isomerizing]
Synonyms:
GFA1 Glucosamine-6- Phosphate Synthase
Type:
Enzyme
Mol. Mass.:
79262.13
Organism:
Candida albicans
Description:
P53704
Residue:
713
  
Inhibitor
Name:
BDBM85320
Synonyms:
GlcN-6-P synthase inhibitor, 13 (racemic mixture)
Type:
Small organic molecule
Emp. Form.:
C6H14N2O3S
Mol. Mass.:
194.252
SMILES:
COC(=O)C(N)CCS(C)(=N)=O
: