Target
Adenomatous polyposis coli protein
Ligand
BDBM270493
Substrate
Meas. Tech.
Wnt APC Inhibition Assay
IC50
720±n/a nM
Citation
 Hood, JKC, SKWallace, DM 1H-pyrazolo[3,4-b]pyridines and therapeutic uses thereof US Patent  US10071086 Publication Date 9/11/2018 
Target
Name:
Adenomatous polyposis coli protein
Synonyms:
APC DP2.5 Protein APC
Type:
Enzyme Catalytic Domain
Mol. Mass.:
311681.21
Organism:
Homo sapiens (Human)
Description:
Residue:
2843
  
Inhibitor
Name:
BDBM270493
Synonyms:
US10071086, Compound 28
Type:
Small organic molecule
Emp. Form.:
C29H25FN8
Mol. Mass.:
504.5608
SMILES:
Fc1cccc(c1)-c1cncc2[nH]c(nc12)-c1n[nH]c2ncc(cc12)-c1cncc(CN2CCCCC2)c1
: