Target
Adenomatous polyposis coli protein
Ligand
BDBM275732
Substrate
Meas. Tech.
Wnt APC Inhibition Assay
IC50
354±n/a nM
Citation
 Hood, JKC, SKWallace, DM 1H-pyrazolo[3,4-b]pyridines and therapeutic uses thereof US Patent  US10071086 Publication Date 9/11/2018 
Target
Name:
Adenomatous polyposis coli protein
Synonyms:
APC DP2.5 Protein APC
Type:
Enzyme Catalytic Domain
Mol. Mass.:
311681.21
Organism:
Homo sapiens (Human)
Description:
Residue:
2843
  
Inhibitor
Name:
BDBM275732
Synonyms:
US10071086, Compound 595
Type:
Small organic molecule
Emp. Form.:
C32H22FN7O
Mol. Mass.:
539.5618
SMILES:
Fc1ccccc1-c1cccc2[nH]c(nc12)-c1n[nH]c2ncc(cc12)-c1cncc(NC(=O)Cc2ccccc2)c1
: