Target
5-hydroxytryptamine receptor 1A
Ligand
BDBM81497
Substrate
Ki
44±n/a nM
Comments
PDSP_491
Citation
 Toll, LBerzetei-Gurske, IPPolgar, WEBrandt, SRAdapa, IDRodriguez, LSchwartz, RWHaggart, DO'Brien, AWhite, AKennedy, JMCraymer, KFarrington, LAuh, JS Standard binding and functional assays related to medications development division testing for potential cocaine and opiate narcotic treatment medications. NIDA Res Monogr 178:440-66 (1998) Target
Name:
5-hydroxytryptamine receptor 1A
Synonyms:
5-HT-1A 5-hydroxytryptamine receptor 1A (5-HT-1A) ADRB2RL1 Dopamine D2 receptor and serotonin 1a receptor HTR1A | Serotonin receptor 1A
Type:
Mol. Mass.:
46122.49
Organism:
Homo sapiens (Human)
Description:
Residue:
422
  
Inhibitor
Name:
BDBM81497
Synonyms:
4-(4-Methyl-piperazin-1-yl)-7-trifluoromethyl-pyrrolo[1,2-a]quinoxaline CGS 12066B NSC_123945
Type:
Small organic molecule
Emp. Form.:
C17H17F3N4
Mol. Mass.:
334.3389
SMILES:
CN1CCN(CC1)c1nc2cc(ccc2n2cccc12)C(F)(F)F
: