Target
5-hydroxytryptamine receptor 1A
Ligand
BDBM50007871
Substrate
Ki
>10000±n/a nM
Comments
PDSP_956
Citation
 Toll, LBerzetei-Gurske, IPPolgar, WEBrandt, SRAdapa, IDRodriguez, LSchwartz, RWHaggart, DO'Brien, AWhite, AKennedy, JMCraymer, KFarrington, LAuh, JS Standard binding and functional assays related to medications development division testing for potential cocaine and opiate narcotic treatment medications. NIDA Res Monogr 178:440-66 (1998) Target
Name:
5-hydroxytryptamine receptor 1A
Synonyms:
5-HT-1A 5-hydroxytryptamine receptor 1A (5-HT-1A) ADRB2RL1 Dopamine D2 receptor and serotonin 1a receptor HTR1A | Serotonin receptor 1A
Type:
Mol. Mass.:
46122.49
Organism:
Homo sapiens (Human)
Description:
Residue:
422
  
Inhibitor
Name:
BDBM50007871
Synonyms:
CHEMBL8197 TROPISETRON
Type:
Small organic molecule
Emp. Form.:
C17H20N2O2
Mol. Mass.:
284.3529
SMILES:
CN1C2CCC1CC(C2)OC(=O)c1c[nH]c2ccccc12
: