Target
5-hydroxytryptamine receptor 3A
Ligand
BDBM50005246
Substrate
Ki
>10000±n/a nM
Comments
PDSP_296
Citation
 Toll, LBerzetei-Gurske, IPPolgar, WEBrandt, SRAdapa, IDRodriguez, LSchwartz, RWHaggart, DO'Brien, AWhite, AKennedy, JMCraymer, KFarrington, LAuh, JS Standard binding and functional assays related to medications development division testing for potential cocaine and opiate narcotic treatment medications. NIDA Res Monogr 178:440-66 (1998) Target
Name:
5-hydroxytryptamine receptor 3A
Synonyms:
5-HT-3 5-HT3A 5-HT3R 5-hydroxytryptamine receptor 3A 5ht3 Htr3a Serotonin 3a (5-HT3a) receptor Serotonin-gated ion channel receptor
Type:
Mol. Mass.:
56056.00
Organism:
Mus musculus (house mouse)
Description:
5HT3A
Residue:
487
  
Inhibitor
Name:
BDBM50005246
Synonyms:
1-Phenylpropan-2-amin 1-phenylpropan-2-amine AMPHETAMINE Amfetamine DEXTROAMP SACCHARATE alpha-methylphenylethylamine beta-Phenylisopropylamin beta-phenylisopropylamine | desoxynorephedrine
Type:
Small organic molecule
Emp. Form.:
C9H13N
Mol. Mass.:
135.2062
SMILES:
CC(N)Cc1ccccc1
: