Target
Metabotropic glutamate receptor 4
Ligand
BDBM85356
Substrate
Ki
>10000±n/a nM
Comments
PDSP_6982
Citation
 Bräuner-Osborne, HNielsen, BKrogsgaard-Larsen, P Molecular pharmacology of homologues of ibotenic acid at cloned metabotropic glutamic acid receptors. Eur J Pharmacol 350:311-6 (1998)  
Target
Name:
Metabotropic glutamate receptor 4
Synonyms:
GRM4_RAT Grm4 Metabotropic glutamate receptor 4 (mGlu4) mGlu4 metabotropic glutamate 4a
Type:
Enzyme
Mol. Mass.:
101849.79
Organism:
Rattus norvegicus (Rat)
Description:
P31423
Residue:
912
  
Inhibitor
Name:
BDBM85356
Synonyms:
(S)-2-Aminoadipic acid | CAS_542-32-5
Type:
Small organic molecule
Emp. Form.:
C6H11NO4
Mol. Mass.:
161.1558
SMILES:
N[C@H](CCCC(O)=O)C(O)=O
: