Target
Metabotropic glutamate receptor 5
Ligand
BDBM85356
Substrate
Ki
>10000±n/a nM
Comments
PDSP_6982
Citation
 Bräuner-Osborne, HNielsen, BKrogsgaard-Larsen, P Molecular pharmacology of homologues of ibotenic acid at cloned metabotropic glutamic acid receptors. Eur J Pharmacol 350:311-6 (1998)  
Target
Name:
Metabotropic glutamate receptor 5
Synonyms:
GRM5_RAT Grm5 Mglur5 metabotropic glutamate 5/1-C metabotropic glutamate 5a
Type:
Enzyme
Mol. Mass.:
131900.14
Organism:
Rattus norvegicus (Rat)
Description:
P31424
Residue:
1203
  
Inhibitor
Name:
BDBM85356
Synonyms:
(S)-2-Aminoadipic acid | CAS_542-32-5
Type:
Small organic molecule
Emp. Form.:
C6H11NO4
Mol. Mass.:
161.1558
SMILES:
N[C@H](CCCC(O)=O)C(O)=O
: