Target
Galanin receptor type 2
Ligand
BDBM50273370
Substrate
Ki
3.24±n/a nM
Comments
PDSP_3167
Citation
 Smith, KEWalker, MWArtymyshyn, RBard, JBorowsky, BTamm, JAYao, WJVaysse, PJBranchek, TAGerald, CJones, KA Cloned human and rat galanin GALR3 receptors. Pharmacology and activation of G-protein inwardly rectifying K+ channels. J Biol Chem 273:23321-6 (1998)  
Target
Name:
Galanin receptor type 2
Synonyms:
GALR2_RAT Galanin receptor 2 Galnr2 | Galr2
Type:
Enzyme Catalytic Domain
Mol. Mass.:
40697.04
Organism:
RAT
Description:
Galanin R2 GALR2 RAT::O08726
Residue:
372
  
Inhibitor
Name:
BDBM50273370
Synonyms:
CHEMBL503473 Galanin (1-13)-bradikinin(2-9) M35
Type:
Small organic molecule
Emp. Form.:
C107H153N27O26
Mol. Mass.:
2233.525
SMILES:
CC(C)C[C@H](NC(=O)[C@H](CC(C)C)NC(=O)[C@H](Cc1ccc(O)cc1)NC(=O)CNC(=O)[C@H](C)NC(=O)[C@H](CO)NC(=O)[C@H](CC(N)=O)NC(=O)[C@H](CC(C)C)NC(=O)[C@@H](NC(=O)[C@H](Cc1c[nH]c2ccccc12)NC(=O)CN)[C@@H](C)O)C(=O)NCC(=O)N1CCC[C@H]1C(=O)N1CCC[C@H]1C(=O)N1CCC[C@H]1C(=O)NCC(=O)N[C@@H](Cc1ccccc1)C(=O)N[C@@H](CO)C(=O)N1CCC[C@H]1C(=O)N[C@@H](Cc1ccccc1)C(=O)N[C@@H](CCCN=C(N)N)C(N)=O
: