Target
Muscarinic acetylcholine receptor M4
Ligand
BDBM85381
Substrate
Ki
120.22±n/a nM
Comments
PDSP_1457
Citation
 Chelala, JLKilani, AMiller, MJMartin, RJErnsberger, P Muscarinic receptor binding sites of the M4 subtype in porcine lung parenchyma. Pharmacol Toxicol 83:200-7 (1998)  
Target
Name:
Muscarinic acetylcholine receptor M4
Synonyms:
CHRM4 Cholinergic, muscarinic M4
Type:
Enzyme Catalytic Domain
Mol. Mass.:
30028.84
Organism:
bovine
Description:
A6QQE4
Residue:
271
  
Inhibitor
Name:
BDBM85381
Synonyms:
CAS_116679-83-5 p-fluoro-hexahydro-sila-difenidol
Type:
Small organic molecule
Emp. Form.:
C20H32FNOSi
Mol. Mass.:
349.5581
SMILES:
O[Si](CCCN1CCCCC1)(C1CCCCC1)c1ccc(F)cc1
: