Target
Fibroblast growth factor receptor 1
Ligand
BDBM275775
Substrate
Meas. Tech.
MRC-5 Human Lung Fibroblasts Assay
EC50
30000±0 nM
Citation
 Hostetler, KYBeadle, JR Phosphonate compounds US Patent  US10071110 Publication Date 9/11/2018 
Target
Name:
Fibroblast growth factor receptor 1
Synonyms:
BFGFR Basic fibroblast growth factor receptor 1 (FGFR1) CEK FGFR-1 FGFR-1, (FL) FGFR1_HUMAN FLT2 Fibroblast growth factor receptor 1 (FGFR-1) Fms-like tyrosine kinase 2 N-sam bFGF-R | c-fgr
Type:
Receptor
Mol. Mass.:
91861.70
Organism:
Homo sapiens (Human)
Description:
P11362
Residue:
822
  
Inhibitor
Name:
BDBM275775
Synonyms:
US10071110, Compound 1-O-octadecylpropanediol-3-CDV
Type:
Small organic molecule
Emp. Form.:
C29H56N3O7P
Mol. Mass.:
589.7446
SMILES:
(O)(=O)COC(CO)Cn1ccc(N)nc1=O
: