Target
Fibroblast growth factor receptor 1
Ligand
BDBM275781
Substrate
Meas. Tech.
MRC-5 Human Lung Fibroblasts Assay
EC50
210±n/a nM
Citation
 Hostetler, KYBeadle, JR Phosphonate compounds US Patent  US10071110 Publication Date 9/11/2018 
Target
Name:
Fibroblast growth factor receptor 1
Synonyms:
BFGFR Basic fibroblast growth factor receptor 1 (FGFR1) CEK FGFR-1 FGFR-1, (FL) FGFR1_HUMAN FLT2 Fibroblast growth factor receptor 1 (FGFR-1) Fms-like tyrosine kinase 2 N-sam bFGF-R | c-fgr
Type:
Receptor
Mol. Mass.:
91861.70
Organism:
Homo sapiens (Human)
Description:
P11362
Residue:
822
  
Inhibitor
Name:
BDBM275781
Synonyms:
US10071110, Compound 1-O-octadecyl-sn-glycero-3-ADV
Type:
Small organic molecule
Emp. Form.:
C29H54N5O6P
Mol. Mass.:
599.7427
SMILES:
[C@H](CO)OP(O)(=O)COCCn1cnc2c(N)ncnc12
: