Target
Melatonin receptor type 1C
Ligand
BDBM85383
Substrate
Ki
1380.38±n/a nM
Comments
PDSP_176
Citation
 Teh, MTSugden, D Comparison of the structure-activity relationships of melatonin receptor agonists and antagonists: lengthening the N-acyl side-chain has differing effects on potency on Xenopus melanophores. Naunyn Schmiedebergs Arch Pharmacol 358:522-8 (1998)  
Target
Name:
Melatonin receptor type 1C
Synonyms:
MTR1C_XENLA Melatonin receptor 1C mtnr1c
Type:
Enzyme Catalytic Domain
Mol. Mass.:
47442.40
Organism:
Xenopus
Description:
Melatonin 1C 0 Xenopus::P49219
Residue:
420
  
Inhibitor
Name:
BDBM85383
Synonyms:
Luzindole,5-MeOT-N-hexanyl
Type:
Emp. Form.:
C24H30N2O2
Mol. Mass.:
378.5072
SMILES:
CCCCCC(=O)NCCc1c(Cc2ccccc2)[nH]c2ccc(OC)cc12
: