Target
5-hydroxytryptamine receptor 2C
Ligand
BDBM50005249
Substrate
Ki
1.1±n/a nM
Comments
PDSP_733
Citation
 Nelson, DLLucaites, VLWainscott, DBGlennon, RA Comparisons of hallucinogenic phenylisopropylamine binding affinities at cloned human 5-HT2A, -HT(2B) and 5-HT2C receptors. Naunyn Schmiedebergs Arch Pharmacol 359:1-6 (1999)  
Target
Name:
5-hydroxytryptamine receptor 2C
Synonyms:
5-HT-2C 5-HT2C-INI 5-HTR2C 5-hydroxytryptamine receptor 2C (5-HT-2C) 5HT-1C HTR1C Serotonin (5-HT3) receptor Serotonin Receptor 2C
Type:
G Protein-Coupled Receptor (GPCR)
Mol. Mass.:
51836.79
Organism:
Homo sapiens (Human)
Description:
P28335
Residue:
458
  
Inhibitor
Name:
BDBM50005249
Synonyms:
2-(2,5-Dimethoxy-4-propyl-phenyl)-1-methyl-ethylamine CHEMBL8569 | DOPR
Type:
Small organic molecule
Emp. Form.:
C14H23NO2
Mol. Mass.:
237.3379
SMILES:
CCCc1cc(OC)c(CC(C)N)cc1OC
: