Target
Lysine-specific histone demethylase 1A [151-852]
Ligand
BDBM111194
Substrate
Meas. Tech.
LANCE LSD1/KDM1A Demethylase Assay
pH
7.5±n/a
Temperature
298.15±n/a K
IC50
<50±n/a nM
Comments
extracted
Citation
 Wu, LCourter, JRHe, CLi, JLu, LSun, YWang, XYao, WZhang, CZhuo, J Substituted imidazo[1,2-a]pyrazines as LSD1 inhibitors US Patent  US9695180 Publication Date 7/4/2017 
Target
Name:
Lysine-specific histone demethylase 1A [151-852]
Synonyms:
AOF2 KDM1A KIAA0601 Lysine-specific histone demethylase 1A
Type:
Mol. Mass.:
77867.68
Organism:
Homo sapiens (Human)
Description:
ENZO (BML-SE544-0050) which consists of 151-852 aa
Residue:
702
  
Inhibitor
Name:
BDBM111194
Synonyms:
US10112950, Example 46 US9695180, 46
Type:
Small organic molecule
Emp. Form.:
C29H32N6O
Mol. Mass.:
480.604
SMILES:
CN(C)Cc1cn2c(-c3ccc(C)cc3)c(nc(OC[C@@H]3CCN(C)C3)c2n1)-c1ccc(cc1)C#N
: