Target
Lysine-specific histone demethylase 1A [151-852]
Ligand
BDBM111205
Substrate
Meas. Tech.
LANCE LSD1/KDM1A Demethylase Assay
pH
7.5±n/a
Temperature
298.15±n/a K
IC50
<50±n/a nM
Comments
extracted
Citation
 Wu, LCourter, JRHe, CLi, JLu, LSun, YWang, XYao, WZhang, CZhuo, J Substituted imidazo[1,2-a]pyrazines as LSD1 inhibitors US Patent  US9695180 Publication Date 7/4/2017 
Target
Name:
Lysine-specific histone demethylase 1A [151-852]
Synonyms:
AOF2 KDM1A KIAA0601 Lysine-specific histone demethylase 1A
Type:
Mol. Mass.:
77867.68
Organism:
Homo sapiens (Human)
Description:
ENZO (BML-SE544-0050) which consists of 151-852 aa
Residue:
702
  
Inhibitor
Name:
BDBM111205
Synonyms:
US10112950, Example 57 US9695180, 57
Type:
Small organic molecule
Emp. Form.:
C29H30N8O
Mol. Mass.:
506.6015
SMILES:
CN(C)C1CCN(CC1)c1nc(-c2ccc(cc2)C#N)c(-c2ccc(nc2)N2CCCC2=O)n2ccnc12
: