Target
Lysine-specific histone demethylase 1A [151-852]
Ligand
BDBM112394
Substrate
Meas. Tech.
LANCE LSD1/KDM1A Demethylase Assay
pH
7.5±n/a
Temperature
298.15±n/a K
IC50
<50±n/a nM
Comments
extracted
Citation
 Wu, LCourter, JRHe, CLi, JLu, LSun, YWang, XYao, WZhang, CZhuo, J Substituted imidazo[1,2-a]pyrazines as LSD1 inhibitors US Patent  US9695180 Publication Date 7/4/2017 
Target
Name:
Lysine-specific histone demethylase 1A [151-852]
Synonyms:
AOF2 KDM1A KIAA0601 Lysine-specific histone demethylase 1A
Type:
Mol. Mass.:
77867.68
Organism:
Homo sapiens (Human)
Description:
ENZO (BML-SE544-0050) which consists of 151-852 aa
Residue:
702
  
Inhibitor
Name:
BDBM112394
Synonyms:
US10112950, Example 88 US9695180, 88
Type:
Small organic molecule
Emp. Form.:
C29H28FN5O2
Mol. Mass.:
497.5633
SMILES:
CN1CCC[C@@H](COc2nc(-c3ccc(cc3)C#N)c(-c3cc4CCC(O)c4c(F)c3)n3ccnc23)C1
: