Target
Lysine-specific histone demethylase 1A [151-852]
Ligand
BDBM112485
Substrate
Meas. Tech.
LANCE LSD1/KDM1A Demethylase Assay
pH
7.5±n/a
Temperature
298.15±n/a K
IC50
<50±n/a nM
Comments
extracted
Citation
 Wu, LCourter, JRHe, CLi, JLu, LSun, YWang, XYao, WZhang, CZhuo, J Substituted imidazo[1,2-a]pyrazines as LSD1 inhibitors US Patent  US9695180 Publication Date 7/4/2017 
Target
Name:
Lysine-specific histone demethylase 1A [151-852]
Synonyms:
AOF2 KDM1A KIAA0601 Lysine-specific histone demethylase 1A
Type:
Mol. Mass.:
77867.68
Organism:
Homo sapiens (Human)
Description:
ENZO (BML-SE544-0050) which consists of 151-852 aa
Residue:
702
  
Inhibitor
Name:
BDBM112485
Synonyms:
US10112950, Example 105 US9695180, 105
Type:
Small organic molecule
Emp. Form.:
C28H28N8O2
Mol. Mass.:
508.5743
SMILES:
CCn1c2ncc(cc2oc1=O)-c1c(nc(N2CCC(CC2)N(C)C)c2nccn12)-c1ccc(cc1)C#N
: