Target
Sodium channel protein type 9 subunit alpha
Ligand
BDBM275790
Substrate
Meas. Tech.
Binding Assay
pH
7.4±n/a
Temperature
298.15±n/a K
IC50
1131±n/a nM
Comments
extracted
Citation
 Dehnhardt, CMChowdhury, SFocken, TGrimwood, MEHemeon, IWSafina, BSutherlin, DP N-substituted benzamides and methods of use thereof US Patent  US10071957 Publication Date 9/11/2018 
Target
Name:
Sodium channel protein type 9 subunit alpha
Synonyms:
NENA Peripheral sodium channel 1 SCN9A_HUMAN Voltage-gated sodium channel subunit Nav1.7 hNE-Na
Type:
Protein
Mol. Mass.:
226375.97
Organism:
Homo sapiens (Human)
Description:
Q15858
Residue:
1988
  
Inhibitor
Name:
BDBM275790
Synonyms:
5-chloro-4-(4-chloro- 3-(trifluoromethyl) phenoxy)-2-fluoro- N-sulfamoyl- benzamide | US10071957, Example 7
Type:
Small organic molecule
Emp. Form.:
C14H8Cl2F4N2O4S
Mol. Mass.:
447.189
SMILES:
NS(=O)(=O)NC(=O)c1cc(Cl)c(Oc2ccc(Cl)c(c2)C(F)(F)F)cc1F
: