Target
Sodium channel protein type 9 subunit alpha
Ligand
BDBM275807
Substrate
Meas. Tech.
Electrophysiological Assay (In Vitro Assay)
pH
7.2±n/a
IC50
34.0±n/a nM
Comments
extracted
Citation
 Dehnhardt, CMChowdhury, SFocken, TGrimwood, MEHemeon, IWSafina, BSutherlin, DP N-substituted benzamides and methods of use thereof US Patent  US10071957 Publication Date 9/11/2018 
Target
Name:
Sodium channel protein type 9 subunit alpha
Synonyms:
NENA Peripheral sodium channel 1 SCN9A_HUMAN Voltage-gated sodium channel subunit Nav1.7 hNE-Na
Type:
Protein
Mol. Mass.:
226375.97
Organism:
Homo sapiens (Human)
Description:
Q15858
Residue:
1988
  
Inhibitor
Name:
BDBM275807
Synonyms:
5-chloro-4-((5-chloro- 6-isobutoxypyridin- 3-yl)oxy)-2-fluoro- N-((1-methyl-1H- imidazol-4-yl) sulfonyl)benzamide | US10071957, Example 24
Type:
Small organic molecule
Emp. Form.:
C20H19Cl2FN4O5S
Mol. Mass.:
517.358
SMILES:
CC(C)COc1ncc(Oc2cc(F)c(cc2Cl)C(=O)NS(=O)(=O)c2cn(C)cn2)cc1Cl
: