Target
Sodium channel protein type 9 subunit alpha
Ligand
BDBM275813
Substrate
Meas. Tech.
Electrophysiological Assay (In Vitro Assay)
pH
7.2±n/a
IC50
34.0±n/a nM
Comments
extracted
Citation
 Dehnhardt, CMChowdhury, SFocken, TGrimwood, MEHemeon, IWSafina, BSutherlin, DP N-substituted benzamides and methods of use thereof US Patent  US10071957 Publication Date 9/11/2018 
Target
Name:
Sodium channel protein type 9 subunit alpha
Synonyms:
NENA Peripheral sodium channel 1 SCN9A_HUMAN Voltage-gated sodium channel subunit Nav1.7 hNE-Na
Type:
Protein
Mol. Mass.:
226375.97
Organism:
Homo sapiens (Human)
Description:
Q15858
Residue:
1988
  
Inhibitor
Name:
BDBM275813
Synonyms:
5-chloro-4-(5-chloro- 6-(2,2,3,3-tetrafluoro- propoxy)pyridin-3- yloxy)-N-(N,N- dimethylsulfamoyl)- 2-fluorobenzamide | US10071957, Example 30
Type:
Small organic molecule
Emp. Form.:
C17H14Cl2F5N3O5S
Mol. Mass.:
538.273
SMILES:
CN(C)S(=O)(=O)NC(=O)c1cc(Cl)c(Oc2cnc(OCC(F)(F)C(F)F)c(Cl)c2)cc1F
: