Target
Sodium channel protein type 9 subunit alpha
Ligand
BDBM275844
Substrate
Meas. Tech.
Binding Assay
pH
7.4±n/a
Temperature
298.15±n/a K
IC50
140±n/a nM
Comments
extracted
Citation
 Dehnhardt, CMChowdhury, SFocken, TGrimwood, MEHemeon, IWSafina, BSutherlin, DP N-substituted benzamides and methods of use thereof US Patent  US10071957 Publication Date 9/11/2018 
Target
Name:
Sodium channel protein type 9 subunit alpha
Synonyms:
NENA Peripheral sodium channel 1 SCN9A_HUMAN Voltage-gated sodium channel subunit Nav1.7 hNE-Na
Type:
Protein
Mol. Mass.:
226375.97
Organism:
Homo sapiens (Human)
Description:
Q15858
Residue:
1988
  
Inhibitor
Name:
BDBM275844
Synonyms:
5-chloro-4-((5-chloro- 6-(piperidin-1-yl) pyridin-3-yl)oxy)- N-(N,N-dimethyl- sulfamoyl)-2-fluoro- benzamide | US10071957, Example 63
Type:
Small organic molecule
Emp. Form.:
C19H21Cl2FN4O4S
Mol. Mass.:
491.364
SMILES:
CN(C)S(=O)(=O)NC(=O)c1cc(Cl)c(Oc2cnc(N3CCCCC3)c(Cl)c2)cc1F
: