Target
Sodium channel protein type 9 subunit alpha
Ligand
BDBM275872
Substrate
Meas. Tech.
Electrophysiological Assay (In Vitro Assay)
pH
7.2±n/a
IC50
6.70±n/a nM
Comments
extracted
Citation
 Dehnhardt, CMChowdhury, SFocken, TGrimwood, MEHemeon, IWSafina, BSutherlin, DP N-substituted benzamides and methods of use thereof US Patent  US10071957 Publication Date 9/11/2018 
Target
Name:
Sodium channel protein type 9 subunit alpha
Synonyms:
NENA Peripheral sodium channel 1 SCN9A_HUMAN Voltage-gated sodium channel subunit Nav1.7 hNE-Na
Type:
Protein
Mol. Mass.:
226375.97
Organism:
Homo sapiens (Human)
Description:
Q15858
Residue:
1988
  
Inhibitor
Name:
BDBM275872
Synonyms:
US10071957, Example 91
Type:
Small organic molecule
Emp. Form.:
C20H21ClFN3O5S
Mol. Mass.:
469.914
SMILES:
CC(C)Oc1ncc(Oc2cc(F)c(cc2C=C)C(=O)NS(=O)(=O)N2CCC2)cc1Cl
: