Target
Corticotropin-releasing factor receptor 2
Ligand
BDBM85397
Substrate
Ki
>10000±n/a nM
Comments
PDSP_586
Citation
 Okuyama, SChaki, SKawashima, NSuzuki, YOgawa, SNakazato, AKumagai, TOkubo, TTomisawa, K Receptor binding, behavioral, and electrophysiological profiles of nonpeptide corticotropin-releasing factor subtype 1 receptor antagonists CRA1000 and CRA1001. J Pharmacol Exp Ther 289:926-35 (1999) Target
Name:
Corticotropin-releasing factor receptor 2
Synonyms:
CRF-R-2 CRF2 Beta CRFR2_RAT CRH-R2 Corticotropin-releasing factor receptor 2 Crf2r | Crhr2
Type:
Enzyme Catalytic Domain
Mol. Mass.:
47697.09
Organism:
RAT
Description:
CRF2 Beta 0 RAT::P47866
Residue:
411
  
Inhibitor
Name:
BDBM85397
Synonyms:
CRA1000
Type:
Small organic molecule
Emp. Form.:
C29H35FN4S
Mol. Mass.:
490.678
SMILES:
CCN(c1nc(C)cc(n1)N1CCC=C(C1)c1cccc(F)c1)c1ccc(CC(C)C)cc1SC
: