Target
D(2) dopamine receptor
Ligand
BDBM85413
Substrate
Ki
0.21±n/a nM
Comments
PDSP_683
Citation
 Lawler, CPPrioleau, CLewis, MMMak, CJiang, DSchetz, JAGonzalez, AMSibley, DRMailman, RB Interactions of the novel antipsychotic aripiprazole (OPC-14597) with dopamine and serotonin receptor subtypes. Neuropsychopharmacology 20:612-27 (1999)  
Target
Name:
D(2) dopamine receptor
Synonyms:
DOPAMINE D2 DOPAMINE D2 Short Dopamine D2 receptor Drd2
Type:
G Protein-Coupled Receptor (GPCR)
Mol. Mass.:
50931.60
Organism:
Rattus norvegicus (rat)
Description:
P61169
Residue:
444
  
Inhibitor
Name:
BDBM85413
Synonyms:
7-{4-[4-(4-hydroxy-2,3-dimethylphenyl)piperazin-1-yl]butoxy}-1,2,3,4-tetrahydroquinolin-2-one | DM 1451
Type:
Small organic molecule
Emp. Form.:
C25H33N3O3
Mol. Mass.:
423.5478
SMILES:
Cc1c(O)ccc(N2CCN(CCCCOc3ccc4CCC(=O)Nc4c3)CC2)c1C
: