Target
Sodium-dependent dopamine transporter
Ligand
BDBM85417
Substrate
Ki
3.26±n/a nM
Comments
PDSP_1632
Citation
 Damaj, MISlemmer, JECarroll, FIMartin, BR Pharmacological characterization of nicotine's interaction with cocaine and cocaine analogs. J Pharmacol Exp Ther 289:1229-36 (1999) Target
Name:
Sodium-dependent dopamine transporter
Synonyms:
DA transporter SC6A3_RAT Sodium-dependent dopamine transporter | Sodium-dependent dopamine transporter (DAT)
Type:
Multi-pass membrane protein
Mol. Mass.:
68749.45
Organism:
Rattus norvegicus (rat)
Description:
P23977
Residue:
619
  
Inhibitor
Name:
BDBM85417
Synonyms:
RTI-120
Type:
Small organic molecule
Emp. Form.:
C22H25NO2
Mol. Mass.:
335.4394
SMILES:
CN1[C@H]2CC[C@@H]1[C@H]([C@H](C2)c1ccc(C)cc1)C(=O)Oc1ccccc1
: